{"text_format":"1","workbook":"xlsx","n_sheets":2,"sheets":["Pareto Chart","Pareto Table"],"not_rendered":{"charts":1,"images":1,"macros":1,"external_links":0,"defined_names":4,"comments":0,"pivot_tables":0},"unopened":[],"bounds":{"document_bytes":16777216,"sheet_cells":100000,"rows_first":2000,"rows_last":500,"rows_between":2000,"halvings":0,"cell_chars":16384,"cell_head_chars":4096},"cells_cut":0,"cells_raw":0,"read":"whole","date_system":"1900"}

{"sheet":"Pareto Chart","index":0,"n_rows":7,"n_cols":15,"rows_kept":7,"cut":false,"hidden":false,"merged":[[0,3,1,8],[0,13,0,14]]}
[null,null,null,"Pareto Chart",null,null,null,null,null,null,null,null,null,"Data Input"]
[null,null,null,null,null,null,null,null,null,null,null,null,null,"Cause Category","Numbers"]
[null,null,null,null,null,null,null,null,null,null,null,null,null,"Cause1",2]
[null,null,null,null,null,null,null,null,null,null,null,null,null,"Cause2",4]
[null,null,null,null,null,null,null,null,null,null,null,null,null,"Cause3",6]
[null,null,null,null,null,null,null,null,null,null,null,null,null,"Cause4",2]
[null,null,null,null,null,null,null,null,null,null,null,null,null,"Cause5",10]

{"sheet":"Pareto Table","index":1,"n_rows":100,"n_cols":12,"rows_kept":100,"cut":false,"hidden":true,"merged":[]}
["Cause Category","Numbers","Rank",null,"Cause Category","Numbers","Cumulative Numbers","Cumulative %Age",{"$f":"$L$2&\"% \"&\"Line\"","v":"80% Line"}]
[{"$f":"IF(OR('Pareto Chart'!N3=\"\",'Pareto Chart'!O3=\"\"),\"\",'Pareto Chart'!N3)","v":"Cause1"},{"$f":"IF($A2=\"\",\"\",'Pareto Chart'!O3)","v":2},{"$f":"IF($A2=\"\",\"\",RANK($B2,$B$2:$B$100)+COUNTIF(B$2:B2,B2)-1)","v":4},null,{"$f":"IFERROR(INDEX($A$2:$A$100,MATCH(ROWS($1:1),$C$2:$C$100,0)),\"\")","v":"Cause5"},{"$f":"IFERROR(INDEX($B$2:$B$100,MATCH(ROWS($1:1),$C$2:$C$100,0)),\"\")","v":10},{"$f":"IF($E2=\"\",\"\",SUM($F$2:F2))","v":10},{"$f":"IF($E2=\"\",\"\",$G2/SUM($F$2:$F$100))","v":0.41666666666666669},{"$f":"IF($E2=\"\",\"\",$L$2/100)","v":0.8},null,"Control Value for Slider",80]
[{"$f":"IF(OR('Pareto Chart'!N4=\"\",'Pareto Chart'!O4=\"\"),\"\",'Pareto Chart'!N4)","v":"Cause2"},{"$f":"IF($A3=\"\",\"\",'Pareto Chart'!O4)","v":4},{"$f":"IF($A3=\"\",\"\",RANK($B3,$B$2:$B$100)+COUNTIF(B$2:B3,B3)-1)","v":3},null,{"$f":"IFERROR(INDEX($A$2:$A$100,MATCH(ROWS($1:2),$C$2:$C$100,0)),\"\")","v":"Cause3"},{"$f":"IFERROR(INDEX($B$2:$B$100,MATCH(ROWS($1:2),$C$2:$C$100,0)),\"\")","v":6},{"$f":"IF($E3=\"\",\"\",SUM($F$2:F3))","v":16},{"$f":"IF($E3=\"\",\"\",$G3/SUM($F$2:$F$100))","v":0.66666666666666663},0.8,null,null,"Vertical Line"]
[{"$f":"IF(OR('Pareto Chart'!N5=\"\",'Pareto Chart'!O5=\"\"),\"\",'Pareto Chart'!N5)","v":"Cause3"},{"$f":"IF($A4=\"\",\"\",'Pareto Chart'!O5)","v":6},{"$f":"IF($A4=\"\",\"\",RANK($B4,$B$2:$B$100)+COUNTIF(B$2:B4,B4)-1)","v":2},null,{"$f":"IFERROR(INDEX($A$2:$A$100,MATCH(ROWS($1:3),$C$2:$C$100,0)),\"\")","v":"Cause2"},{"$f":"IFERROR(INDEX($B$2:$B$100,MATCH(ROWS($1:3),$C$2:$C$100,0)),\"\")","v":4},{"$f":"IF($E4=\"\",\"\",SUM($F$2:F4))","v":20},0.83333333333333337,0.8,null,{"$f":"IF($L$2=100,SUMPRODUCT(--($E$2:$E$100<>\"\")),IF(ISERROR(MATCH($L$2/100,$H$2:$H$100)),1,MATCH($L$2/100,$H$2:$H$100)+(($L$2/100-INDEX($H$2:$H$100,MATCH($L$2/100,$H$2:$H$100)))/(INDEX($H$2:$H$100,1+MATCH($L$2/100,$H$2:$H$100))-INDEX($H$2:$H$100,MATCH($L$2/100,$H$2:$H$100))))))","v":2.8000000000000003},0]
[{"$f":"IF(OR('Pareto Chart'!N6=\"\",'Pareto Chart'!O6=\"\"),\"\",'Pareto Chart'!N6)","v":"Cause4"},{"$f":"IF($A5=\"\",\"\",'Pareto Chart'!O6)","v":2},{"$f":"IF($A5=\"\",\"\",RANK($B5,$B$2:$B$100)+COUNTIF(B$2:B5,B5)-1)","v":5},null,{"$f":"IFERROR(INDEX($A$2:$A$100,MATCH(ROWS($1:4),$C$2:$C$100,0)),\"\")","v":"Cause1"},{"$f":"IFERROR(INDEX($B$2:$B$100,MATCH(ROWS($1:4),$C$2:$C$100,0)),\"\")","v":2},{"$f":"IF($E5=\"\",\"\",SUM($F$2:F5))","v":22},0.91666666666666663,0.8,null,{"$f":"K4","v":2.8000000000000003},1]
[{"$f":"IF(OR('Pareto Chart'!N7=\"\",'Pareto Chart'!O7=\"\"),\"\",'Pareto Chart'!N7)","v":"Cause5"},{"$f":"IF($A6=\"\",\"\",'Pareto Chart'!O7)","v":10},{"$f":"IF($A6=\"\",\"\",RANK($B6,$B$2:$B$100)+COUNTIF(B$2:B6,B6)-1)","v":1},null,{"$f":"IFERROR(INDEX($A$2:$A$100,MATCH(ROWS($1:5),$C$2:$C$100,0)),\"\")","v":"Cause4"},{"$f":"IFERROR(INDEX($B$2:$B$100,MATCH(ROWS($1:5),$C$2:$C$100,0)),\"\")","v":2},{"$f":"IF($E6=\"\",\"\",SUM($F$2:F6))","v":24},1,0.8]
[{"$f":"IF(OR('Pareto Chart'!N8=\"\",'Pareto Chart'!O8=\"\"),\"\",'Pareto Chart'!N8)","v":""},{"$f":"IF($A7=\"\",\"\",'Pareto Chart'!O8)","v":""},{"$f":"IF($A7=\"\",\"\",RANK($B7,$B$2:$B$100)+COUNTIF(B$2:B7,B7)-1)","v":""},null,{"$f":"IFERROR(INDEX($A$2:$A$100,MATCH(ROWS($1:6),$C$2:$C$100,0)),\"\")","v":""},{"$f":"IFERROR(INDEX($B$2:$B$100,MATCH(ROWS($1:6),$C$2:$C$100,0)),\"\")","v":""},{"$f":"IF($E7=\"\",\"\",SUM($F$2:F7))","v":""},"",""]
[{"$f":"IF(OR('Pareto Chart'!N9=\"\",'Pareto Chart'!O9=\"\"),\"\",'Pareto Chart'!N9)","v":""},{"$f":"IF($A8=\"\",\"\",'Pareto Chart'!O9)","v":""},{"$f":"IF($A8=\"\",\"\",RANK($B8,$B$2:$B$100)+COUNTIF(B$2:B8,B8)-1)","v":""},null,{"$f":"IFERROR(INDEX($A$2:$A$100,MATCH(ROWS($1:7),$C$2:$C$100,0)),\"\")","v":""},{"$f":"IFERROR(INDEX($B$2:$B$100,MATCH(ROWS($1:7),$C$2:$C$100,0)),\"\")","v":""},{"$f":"IF($E8=\"\",\"\",SUM($F$2:F8))","v":""},"",""]
[{"$f":"IF(OR('Pareto Chart'!N10=\"\",'Pareto Chart'!O10=\"\"),\"\",'Pareto Chart'!N10)","v":""},{"$f":"IF($A9=\"\",\"\",'Pareto Chart'!O10)","v":""},{"$f":"IF($A9=\"\",\"\",RANK($B9,$B$2:$B$100)+COUNTIF(B$2:B9,B9)-1)","v":""},null,{"$f":"IFERROR(INDEX($A$2:$A$100,MATCH(ROWS($1:8),$C$2:$C$100,0)),\"\")","v":""},{"$f":"IFERROR(INDEX($B$2:$B$100,MATCH(ROWS($1:8),$C$2:$C$100,0)),\"\")","v":""},{"$f":"IF($E9=\"\",\"\",SUM($F$2:F9))","v":""},"",""]
[{"$f":"IF(OR('Pareto Chart'!N11=\"\",'Pareto Chart'!O11=\"\"),\"\",'Pareto Chart'!N11)","v":""},{"$f":"IF($A10=\"\",\"\",'Pareto Chart'!O11)","v":""},{"$f":"IF($A10=\"\",\"\",RANK($B10,$B$2:$B$100)+COUNTIF(B$2:B10,B10)-1)","v":""},null,{"$f":"IFERROR(INDEX($A$2:$A$100,MATCH(ROWS($1:9),$C$2:$C$100,0)),\"\")","v":""},{"$f":"IFERROR(INDEX($B$2:$B$100,MATCH(ROWS($1:9),$C$2:$C$100,0)),\"\")","v":""},{"$f":"IF($E10=\"\",\"\",SUM($F$2:F10))","v":""},"",""]
[{"$f":"IF(OR('Pareto Chart'!N12=\"\",'Pareto Chart'!O12=\"\"),\"\",'Pareto Chart'!N12)","v":""},{"$f":"IF($A11=\"\",\"\",'Pareto Chart'!O12)","v":""},{"$f":"IF($A11=\"\",\"\",RANK($B11,$B$2:$B$100)+COUNTIF(B$2:B11,B11)-1)","v":""},null,{"$f":"IFERROR(INDEX($A$2:$A$100,MATCH(ROWS($1:10),$C$2:$C$100,0)),\"\")","v":""},{"$f":"IFERROR(INDEX($B$2:$B$100,MATCH(ROWS($1:10),$C$2:$C$100,0)),\"\")","v":""},{"$f":"IF($E11=\"\",\"\",SUM($F$2:F11))","v":""},"",""]
[{"$f":"IF(OR('Pareto Chart'!N13=\"\",'Pareto Chart'!O13=\"\"),\"\",'Pareto Chart'!N13)","v":""},{"$f":"IF($A12=\"\",\"\",'Pareto Chart'!O13)","v":""},{"$f":"IF($A12=\"\",\"\",RANK($B12,$B$2:$B$100)+COUNTIF(B$2:B12,B12)-1)","v":""},null,{"$f":"IFERROR(INDEX($A$2:$A$100,MATCH(ROWS($1:11),$C$2:$C$100,0)),\"\")","v":""},{"$f":"IFERROR(INDEX($B$2:$B$100,MATCH(ROWS($1:11),$C$2:$C$100,0)),\"\")","v":""},{"$f":"IF($E12=\"\",\"\",SUM($F$2:F12))","v":""},"",""]
[{"$f":"IF(OR('Pareto Chart'!N14=\"\",'Pareto Chart'!O14=\"\"),\"\",'Pareto Chart'!N14)","v":""},{"$f":"IF($A13=\"\",\"\",'Pareto Chart'!O14)","v":""},{"$f":"IF($A13=\"\",\"\",RANK($B13,$B$2:$B$100)+COUNTIF(B$2:B13,B13)-1)","v":""},null,{"$f":"IFERROR(INDEX($A$2:$A$100,MATCH(ROWS($1:12),$C$2:$C$100,0)),\"\")","v":""},{"$f":"IFERROR(INDEX($B$2:$B$100,MATCH(ROWS($1:12),$C$2:$C$100,0)),\"\")","v":""},{"$f":"IF($E13=\"\",\"\",SUM($F$2:F13))","v":""},"",""]
[{"$f":"IF(OR('Pareto Chart'!N15=\"\",'Pareto Chart'!O15=\"\"),\"\",'Pareto Chart'!N15)","v":""},{"$f":"IF($A14=\"\",\"\",'Pareto Chart'!O15)","v":""},{"$f":"IF($A14=\"\",\"\",RANK($B14,$B$2:$B$100)+COUNTIF(B$2:B14,B14)-1)","v":""},null,{"$f":"IFERROR(INDEX($A$2:$A$100,MATCH(ROWS($1:13),$C$2:$C$100,0)),\"\")","v":""},{"$f":"IFERROR(INDEX($B$2:$B$100,MATCH(ROWS($1:13),$C$2:$C$100,0)),\"\")","v":""},{"$f":"IF($E14=\"\",\"\",SUM($F$2:F14))","v":""},"",""]
[{"$f":"IF(OR('Pareto Chart'!N16=\"\",'Pareto Chart'!O16=\"\"),\"\",'Pareto Chart'!N16)","v":""},{"$f":"IF($A15=\"\",\"\",'Pareto Chart'!O16)","v":""},{"$f":"IF($A15=\"\",\"\",RANK($B15,$B$2:$B$100)+COUNTIF(B$2:B15,B15)-1)","v":""},null,{"$f":"IFERROR(INDEX($A$2:$A$100,MATCH(ROWS($1:14),$C$2:$C$100,0)),\"\")","v":""},{"$f":"IFERROR(INDEX($B$2:$B$100,MATCH(ROWS($1:14),$C$2:$C$100,0)),\"\")","v":""},{"$f":"IF($E15=\"\",\"\",SUM($F$2:F15))","v":""},"",""]
[{"$f":"IF(OR('Pareto Chart'!N17=\"\",'Pareto Chart'!O17=\"\"),\"\",'Pareto Chart'!N17)","v":""},{"$f":"IF($A16=\"\",\"\",'Pareto Chart'!O17)","v":""},{"$f":"IF($A16=\"\",\"\",RANK($B16,$B$2:$B$100)+COUNTIF(B$2:B16,B16)-1)","v":""},null,{"$f":"IFERROR(INDEX($A$2:$A$100,MATCH(ROWS($1:15),$C$2:$C$100,0)),\"\")","v":""},{"$f":"IFERROR(INDEX($B$2:$B$100,MATCH(ROWS($1:15),$C$2:$C$100,0)),\"\")","v":""},{"$f":"IF($E16=\"\",\"\",SUM($F$2:F16))","v":""},"",""]
[{"$f":"IF(OR('Pareto Chart'!N18=\"\",'Pareto Chart'!O18=\"\"),\"\",'Pareto Chart'!N18)","v":""},{"$f":"IF($A17=\"\",\"\",'Pareto Chart'!O18)","v":""},{"$f":"IF($A17=\"\",\"\",RANK($B17,$B$2:$B$100)+COUNTIF(B$2:B17,B17)-1)","v":""},null,{"$f":"IFERROR(INDEX($A$2:$A$100,MATCH(ROWS($1:16),$C$2:$C$100,0)),\"\")","v":""},{"$f":"IFERROR(INDEX($B$2:$B$100,MATCH(ROWS($1:16),$C$2:$C$100,0)),\"\")","v":""},{"$f":"IF($E17=\"\",\"\",SUM($F$2:F17))","v":""},"",""]
[{"$f":"IF(OR('Pareto Chart'!N19=\"\",'Pareto Chart'!O19=\"\"),\"\",'Pareto Chart'!N19)","v":""},{"$f":"IF($A18=\"\",\"\",'Pareto Chart'!O19)","v":""},{"$f":"IF($A18=\"\",\"\",RANK($B18,$B$2:$B$100)+COUNTIF(B$2:B18,B18)-1)","v":""},null,{"$f":"IFERROR(INDEX($A$2:$A$100,MATCH(ROWS($1:17),$C$2:$C$100,0)),\"\")","v":""},{"$f":"IFERROR(INDEX($B$2:$B$100,MATCH(ROWS($1:17),$C$2:$C$100,0)),\"\")","v":""},{"$f":"IF($E18=\"\",\"\",SUM($F$2:F18))","v":""},"",""]
[{"$f":"IF(OR('Pareto Chart'!N20=\"\",'Pareto Chart'!O20=\"\"),\"\",'Pareto Chart'!N20)","v":""},{"$f":"IF($A19=\"\",\"\",'Pareto Chart'!O20)","v":""},{"$f":"IF($A19=\"\",\"\",RANK($B19,$B$2:$B$100)+COUNTIF(B$2:B19,B19)-1)","v":""},null,{"$f":"IFERROR(INDEX($A$2:$A$100,MATCH(ROWS($1:18),$C$2:$C$100,0)),\"\")","v":""},{"$f":"IFERROR(INDEX($B$2:$B$100,MATCH(ROWS($1:18),$C$2:$C$100,0)),\"\")","v":""},{"$f":"IF($E19=\"\",\"\",SUM($F$2:F19))","v":""},"",""]
[{"$f":"IF(OR('Pareto Chart'!N21=\"\",'Pareto Chart'!O21=\"\"),\"\",'Pareto Chart'!N21)","v":""},{"$f":"IF($A20=\"\",\"\",'Pareto Chart'!O21)","v":""},{"$f":"IF($A20=\"\",\"\",RANK($B20,$B$2:$B$100)+COUNTIF(B$2:B20,B20)-1)","v":""},null,{"$f":"IFERROR(INDEX($A$2:$A$100,MATCH(ROWS($1:19),$C$2:$C$100,0)),\"\")","v":""},{"$f":"IFERROR(INDEX($B$2:$B$100,MATCH(ROWS($1:19),$C$2:$C$100,0)),\"\")","v":""},{"$f":"IF($E20=\"\",\"\",SUM($F$2:F20))","v":""},"",""]
[{"$f":"IF(OR('Pareto Chart'!N22=\"\",'Pareto Chart'!O22=\"\"),\"\",'Pareto Chart'!N22)","v":""},{"$f":"IF($A21=\"\",\"\",'Pareto Chart'!O22)","v":""},{"$f":"IF($A21=\"\",\"\",RANK($B21,$B$2:$B$100)+COUNTIF(B$2:B21,B21)-1)","v":""},null,{"$f":"IFERROR(INDEX($A$2:$A$100,MATCH(ROWS($1:20),$C$2:$C$100,0)),\"\")","v":""},{"$f":"IFERROR(INDEX($B$2:$B$100,MATCH(ROWS($1:20),$C$2:$C$100,0)),\"\")","v":""},{"$f":"IF($E21=\"\",\"\",SUM($F$2:F21))","v":""},"",""]
[{"$f":"IF(OR('Pareto Chart'!N23=\"\",'Pareto Chart'!O23=\"\"),\"\",'Pareto Chart'!N23)","v":""},{"$f":"IF($A22=\"\",\"\",'Pareto Chart'!O23)","v":""},{"$f":"IF($A22=\"\",\"\",RANK($B22,$B$2:$B$100)+COUNTIF(B$2:B22,B22)-1)","v":""},null,{"$f":"IFERROR(INDEX($A$2:$A$100,MATCH(ROWS($1:21),$C$2:$C$100,0)),\"\")","v":""},{"$f":"IFERROR(INDEX($B$2:$B$100,MATCH(ROWS($1:21),$C$2:$C$100,0)),\"\")","v":""},{"$f":"IF($E22=\"\",\"\",SUM($F$2:F22))","v":""},"",""]
[{"$f":"IF(OR('Pareto Chart'!N24=\"\",'Pareto Chart'!O24=\"\"),\"\",'Pareto Chart'!N24)","v":""},{"$f":"IF($A23=\"\",\"\",'Pareto Chart'!O24)","v":""},{"$f":"IF($A23=\"\",\"\",RANK($B23,$B$2:$B$100)+COUNTIF(B$2:B23,B23)-1)","v":""},null,{"$f":"IFERROR(INDEX($A$2:$A$100,MATCH(ROWS($1:22),$C$2:$C$100,0)),\"\")","v":""},{"$f":"IFERROR(INDEX($B$2:$B$100,MATCH(ROWS($1:22),$C$2:$C$100,0)),\"\")","v":""},{"$f":"IF($E23=\"\",\"\",SUM($F$2:F23))","v":""},"",""]
[{"$f":"IF(OR('Pareto Chart'!N25=\"\",'Pareto Chart'!O25=\"\"),\"\",'Pareto Chart'!N25)","v":""},{"$f":"IF($A24=\"\",\"\",'Pareto Chart'!O25)","v":""},{"$f":"IF($A24=\"\",\"\",RANK($B24,$B$2:$B$100)+COUNTIF(B$2:B24,B24)-1)","v":""},null,{"$f":"IFERROR(INDEX($A$2:$A$100,MATCH(ROWS($1:23),$C$2:$C$100,0)),\"\")","v":""},{"$f":"IFERROR(INDEX($B$2:$B$100,MATCH(ROWS($1:23),$C$2:$C$100,0)),\"\")","v":""},{"$f":"IF($E24=\"\",\"\",SUM($F$2:F24))","v":""},"",""]
[{"$f":"IF(OR('Pareto Chart'!N26=\"\",'Pareto Chart'!O26=\"\"),\"\",'Pareto Chart'!N26)","v":""},{"$f":"IF($A25=\"\",\"\",'Pareto Chart'!O26)","v":""},{"$f":"IF($A25=\"\",\"\",RANK($B25,$B$2:$B$100)+COUNTIF(B$2:B25,B25)-1)","v":""},null,{"$f":"IFERROR(INDEX($A$2:$A$100,MATCH(ROWS($1:24),$C$2:$C$100,0)),\"\")","v":""},{"$f":"IFERROR(INDEX($B$2:$B$100,MATCH(ROWS($1:24),$C$2:$C$100,0)),\"\")","v":""},{"$f":"IF($E25=\"\",\"\",SUM($F$2:F25))","v":""},"",""]
[{"$f":"IF(OR('Pareto Chart'!N27=\"\",'Pareto Chart'!O27=\"\"),\"\",'Pareto Chart'!N27)","v":""},{"$f":"IF($A26=\"\",\"\",'Pareto Chart'!O27)","v":""},{"$f":"IF($A26=\"\",\"\",RANK($B26,$B$2:$B$100)+COUNTIF(B$2:B26,B26)-1)","v":""},null,{"$f":"IFERROR(INDEX($A$2:$A$100,MATCH(ROWS($1:25),$C$2:$C$100,0)),\"\")","v":""},{"$f":"IFERROR(INDEX($B$2:$B$100,MATCH(ROWS($1:25),$C$2:$C$100,0)),\"\")","v":""},{"$f":"IF($E26=\"\",\"\",SUM($F$2:F26))","v":""},"",""]
[{"$f":"IF(OR('Pareto Chart'!N28=\"\",'Pareto Chart'!O28=\"\"),\"\",'Pareto Chart'!N28)","v":""},{"$f":"IF($A27=\"\",\"\",'Pareto Chart'!O28)","v":""},{"$f":"IF($A27=\"\",\"\",RANK($B27,$B$2:$B$100)+COUNTIF(B$2:B27,B27)-1)","v":""},null,{"$f":"IFERROR(INDEX($A$2:$A$100,MATCH(ROWS($1:26),$C$2:$C$100,0)),\"\")","v":""},{"$f":"IFERROR(INDEX($B$2:$B$100,MATCH(ROWS($1:26),$C$2:$C$100,0)),\"\")","v":""},{"$f":"IF($E27=\"\",\"\",SUM($F$2:F27))","v":""},"",""]
[{"$f":"IF(OR('Pareto Chart'!N29=\"\",'Pareto Chart'!O29=\"\"),\"\",'Pareto Chart'!N29)","v":""},{"$f":"IF($A28=\"\",\"\",'Pareto Chart'!O29)","v":""},{"$f":"IF($A28=\"\",\"\",RANK($B28,$B$2:$B$100)+COUNTIF(B$2:B28,B28)-1)","v":""},null,{"$f":"IFERROR(INDEX($A$2:$A$100,MATCH(ROWS($1:27),$C$2:$C$100,0)),\"\")","v":""},{"$f":"IFERROR(INDEX($B$2:$B$100,MATCH(ROWS($1:27),$C$2:$C$100,0)),\"\")","v":""},{"$f":"IF($E28=\"\",\"\",SUM($F$2:F28))","v":""},"",""]
[{"$f":"IF(OR('Pareto Chart'!N30=\"\",'Pareto Chart'!O30=\"\"),\"\",'Pareto Chart'!N30)","v":""},{"$f":"IF($A29=\"\",\"\",'Pareto Chart'!O30)","v":""},{"$f":"IF($A29=\"\",\"\",RANK($B29,$B$2:$B$100)+COUNTIF(B$2:B29,B29)-1)","v":""},null,{"$f":"IFERROR(INDEX($A$2:$A$100,MATCH(ROWS($1:28),$C$2:$C$100,0)),\"\")","v":""},{"$f":"IFERROR(INDEX($B$2:$B$100,MATCH(ROWS($1:28),$C$2:$C$100,0)),\"\")","v":""},{"$f":"IF($E29=\"\",\"\",SUM($F$2:F29))","v":""},"",""]
[{"$f":"IF(OR('Pareto Chart'!N31=\"\",'Pareto Chart'!O31=\"\"),\"\",'Pareto Chart'!N31)","v":""},{"$f":"IF($A30=\"\",\"\",'Pareto Chart'!O31)","v":""},{"$f":"IF($A30=\"\",\"\",RANK($B30,$B$2:$B$100)+COUNTIF(B$2:B30,B30)-1)","v":""},null,{"$f":"IFERROR(INDEX($A$2:$A$100,MATCH(ROWS($1:29),$C$2:$C$100,0)),\"\")","v":""},{"$f":"IFERROR(INDEX($B$2:$B$100,MATCH(ROWS($1:29),$C$2:$C$100,0)),\"\")","v":""},{"$f":"IF($E30=\"\",\"\",SUM($F$2:F30))","v":""},"",""]
[{"$f":"IF(OR('Pareto Chart'!N32=\"\",'Pareto Chart'!O32=\"\"),\"\",'Pareto Chart'!N32)","v":""},{"$f":"IF($A31=\"\",\"\",'Pareto Chart'!O32)","v":""},{"$f":"IF($A31=\"\",\"\",RANK($B31,$B$2:$B$100)+COUNTIF(B$2:B31,B31)-1)","v":""},null,{"$f":"IFERROR(INDEX($A$2:$A$100,MATCH(ROWS($1:30),$C$2:$C$100,0)),\"\")","v":""},{"$f":"IFERROR(INDEX($B$2:$B$100,MATCH(ROWS($1:30),$C$2:$C$100,0)),\"\")","v":""},{"$f":"IF($E31=\"\",\"\",SUM($F$2:F31))","v":""},"",""]
[{"$f":"IF(OR('Pareto Chart'!N33=\"\",'Pareto Chart'!O33=\"\"),\"\",'Pareto Chart'!N33)","v":""},{"$f":"IF($A32=\"\",\"\",'Pareto Chart'!O33)","v":""},{"$f":"IF($A32=\"\",\"\",RANK($B32,$B$2:$B$100)+COUNTIF(B$2:B32,B32)-1)","v":""},null,{"$f":"IFERROR(INDEX($A$2:$A$100,MATCH(ROWS($1:31),$C$2:$C$100,0)),\"\")","v":""},{"$f":"IFERROR(INDEX($B$2:$B$100,MATCH(ROWS($1:31),$C$2:$C$100,0)),\"\")","v":""},{"$f":"IF($E32=\"\",\"\",SUM($F$2:F32))","v":""},"",""]
[{"$f":"IF(OR('Pareto Chart'!N34=\"\",'Pareto Chart'!O34=\"\"),\"\",'Pareto Chart'!N34)","v":""},{"$f":"IF($A33=\"\",\"\",'Pareto Chart'!O34)","v":""},{"$f":"IF($A33=\"\",\"\",RANK($B33,$B$2:$B$100)+COUNTIF(B$2:B33,B33)-1)","v":""},null,{"$f":"IFERROR(INDEX($A$2:$A$100,MATCH(ROWS($1:32),$C$2:$C$100,0)),\"\")","v":""},{"$f":"IFERROR(INDEX($B$2:$B$100,MATCH(ROWS($1:32),$C$2:$C$100,0)),\"\")","v":""},{"$f":"IF($E33=\"\",\"\",SUM($F$2:F33))","v":""},"",""]
[{"$f":"IF(OR('Pareto Chart'!N35=\"\",'Pareto Chart'!O35=\"\"),\"\",'Pareto Chart'!N35)","v":""},{"$f":"IF($A34=\"\",\"\",'Pareto Chart'!O35)","v":""},{"$f":"IF($A34=\"\",\"\",RANK($B34,$B$2:$B$100)+COUNTIF(B$2:B34,B34)-1)","v":""},null,{"$f":"IFERROR(INDEX($A$2:$A$100,MATCH(ROWS($1:33),$C$2:$C$100,0)),\"\")","v":""},{"$f":"IFERROR(INDEX($B$2:$B$100,MATCH(ROWS($1:33),$C$2:$C$100,0)),\"\")","v":""},{"$f":"IF($E34=\"\",\"\",SUM($F$2:F34))","v":""},"",{"$f":"IF($E34=\"\",\"\",$L$2/100)","v":""}]
[{"$f":"IF(OR('Pareto Chart'!N36=\"\",'Pareto Chart'!O36=\"\"),\"\",'Pareto Chart'!N36)","v":""},{"$f":"IF($A35=\"\",\"\",'Pareto Chart'!O36)","v":""},{"$f":"IF($A35=\"\",\"\",RANK($B35,$B$2:$B$100)+COUNTIF(B$2:B35,B35)-1)","v":""},null,{"$f":"IFERROR(INDEX($A$2:$A$100,MATCH(ROWS($1:34),$C$2:$C$100,0)),\"\")","v":""},{"$f":"IFERROR(INDEX($B$2:$B$100,MATCH(ROWS($1:34),$C$2:$C$100,0)),\"\")","v":""},{"$f":"IF($E35=\"\",\"\",SUM($F$2:F35))","v":""},"",""]
[{"$f":"IF(OR('Pareto Chart'!N37=\"\",'Pareto Chart'!O37=\"\"),\"\",'Pareto Chart'!N37)","v":""},{"$f":"IF($A36=\"\",\"\",'Pareto Chart'!O37)","v":""},{"$f":"IF($A36=\"\",\"\",RANK($B36,$B$2:$B$100)+COUNTIF(B$2:B36,B36)-1)","v":""},null,{"$f":"IFERROR(INDEX($A$2:$A$100,MATCH(ROWS($1:35),$C$2:$C$100,0)),\"\")","v":""},{"$f":"IFERROR(INDEX($B$2:$B$100,MATCH(ROWS($1:35),$C$2:$C$100,0)),\"\")","v":""},{"$f":"IF($E36=\"\",\"\",SUM($F$2:F36))","v":""},"",""]
[{"$f":"IF(OR('Pareto Chart'!N38=\"\",'Pareto Chart'!O38=\"\"),\"\",'Pareto Chart'!N38)","v":""},{"$f":"IF($A37=\"\",\"\",'Pareto Chart'!O38)","v":""},{"$f":"IF($A37=\"\",\"\",RANK($B37,$B$2:$B$100)+COUNTIF(B$2:B37,B37)-1)","v":""},null,{"$f":"IFERROR(INDEX($A$2:$A$100,MATCH(ROWS($1:36),$C$2:$C$100,0)),\"\")","v":""},{"$f":"IFERROR(INDEX($B$2:$B$100,MATCH(ROWS($1:36),$C$2:$C$100,0)),\"\")","v":""},{"$f":"IF($E37=\"\",\"\",SUM($F$2:F37))","v":""},"",""]
[{"$f":"IF(OR('Pareto Chart'!N39=\"\",'Pareto Chart'!O39=\"\"),\"\",'Pareto Chart'!N39)","v":""},{"$f":"IF($A38=\"\",\"\",'Pareto Chart'!O39)","v":""},{"$f":"IF($A38=\"\",\"\",RANK($B38,$B$2:$B$100)+COUNTIF(B$2:B38,B38)-1)","v":""},null,{"$f":"IFERROR(INDEX($A$2:$A$100,MATCH(ROWS($1:37),$C$2:$C$100,0)),\"\")","v":""},{"$f":"IFERROR(INDEX($B$2:$B$100,MATCH(ROWS($1:37),$C$2:$C$100,0)),\"\")","v":""},{"$f":"IF($E38=\"\",\"\",SUM($F$2:F38))","v":""},"",""]
[{"$f":"IF(OR('Pareto Chart'!N40=\"\",'Pareto Chart'!O40=\"\"),\"\",'Pareto Chart'!N40)","v":""},{"$f":"IF($A39=\"\",\"\",'Pareto Chart'!O40)","v":""},{"$f":"IF($A39=\"\",\"\",RANK($B39,$B$2:$B$100)+COUNTIF(B$2:B39,B39)-1)","v":""},null,{"$f":"IFERROR(INDEX($A$2:$A$100,MATCH(ROWS($1:38),$C$2:$C$100,0)),\"\")","v":""},{"$f":"IFERROR(INDEX($B$2:$B$100,MATCH(ROWS($1:38),$C$2:$C$100,0)),\"\")","v":""},{"$f":"IF($E39=\"\",\"\",SUM($F$2:F39))","v":""},"",""]
[{"$f":"IF(OR('Pareto Chart'!N41=\"\",'Pareto Chart'!O41=\"\"),\"\",'Pareto Chart'!N41)","v":""},{"$f":"IF($A40=\"\",\"\",'Pareto Chart'!O41)","v":""},{"$f":"IF($A40=\"\",\"\",RANK($B40,$B$2:$B$100)+COUNTIF(B$2:B40,B40)-1)","v":""},null,{"$f":"IFERROR(INDEX($A$2:$A$100,MATCH(ROWS($1:39),$C$2:$C$100,0)),\"\")","v":""},{"$f":"IFERROR(INDEX($B$2:$B$100,MATCH(ROWS($1:39),$C$2:$C$100,0)),\"\")","v":""},{"$f":"IF($E40=\"\",\"\",SUM($F$2:F40))","v":""},"",""]
{"$rows_left_out":60}