{"text_format":"1","workbook":"xlsx","n_sheets":3,"sheets":["Burnup Chart","Input","Final Data"],"not_rendered":{"charts":4,"images":1,"macros":1,"external_links":0,"defined_names":4,"comments":0,"pivot_tables":0},"unopened":[],"bounds":{"document_bytes":16777216,"sheet_cells":100000,"rows_first":2000,"rows_last":500,"rows_between":2000,"halvings":0,"cell_chars":16384,"cell_head_chars":4096},"cells_cut":0,"cells_raw":0,"read":"whole","date_system":"1900"}

{"sheet":"Burnup Chart","index":0,"n_rows":4,"n_cols":12,"rows_kept":4,"cut":false,"hidden":false,"merged":[[0,3,1,9]]}
[null,null,null,"Burnup Chart",null,null,null,null,null,null,null,"Customize the Legend"]
[null,null,null,null,null,null,null,null,null,null,null,"Scope Planned"]
[null,null,null,null,null,null,null,null,null,null,null,"Scope Completed"]
[null,null,null,null,null,null,null,null,null,null,null,"Ideal Burnup"]

{"sheet":"Input","index":1,"n_rows":18,"n_cols":3,"rows_kept":18,"cut":false,"hidden":false,"merged":[[0,2,0,12]]}
[null,null,"Enter points completed for a Date and Sprint."]
["Dates","Scope / Stories","Completed Scope"]
["2015-01-01",30,5]
[{"$f":"A3+1","v":"2015-01-02"},30,3]
[{"$f":"A4+1","v":"2015-01-03"},30,4]
["2015-01-04",30,6]
["2015-01-05",25,1]
["2015-01-06",25,5]
["2015-01-07",40,6]
["2015-01-08",40,7]
["2015-01-09",40,2]
["2015-01-10",40,2]
["2015-01-11",40,2]
["2015-01-12",40,2]
["2015-01-13",40,2]
["2015-01-14",40,2]
["2015-01-15",40,2]
["2015-01-16",40,2]

{"sheet":"Final Data","index":2,"n_rows":202,"n_cols":62,"rows_kept":202,"cut":false,"hidden":true,"merged":[]}
["Dates",{"$f":"IF('Burnup Chart'!$L$2=\"\",\"Scope Planned\",'Burnup Chart'!$L$2)","v":"Scope Planned"},{"$f":"IF('Burnup Chart'!$L$3=\"\",\"Scope Completed\",'Burnup Chart'!$L$3)","v":"Scope Completed"},{"$f":"IF('Burnup Chart'!$L$4=\"\",\"Ideal Burnup\",'Burnup Chart'!$L$4)","v":"Ideal Burnup"},null,null,null,null,null,null,null,null,null,{"$f":"IF(Input!N$2=\"\",\"\",Input!N$2)","v":""},{"$f":"IF(Input!O$2=\"\",\"\",Input!O$2)","v":""},{"$f":"IF(Input!P$2=\"\",\"\",Input!P$2)","v":""},{"$f":"IF(Input!Q$2=\"\",\"\",Input!Q$2)","v":""},{"$f":"IF(Input!R$2=\"\",\"\",Input!R$2)","v":""},{"$f":"IF(Input!S$2=\"\",\"\",Input!S$2)","v":""},{"$f":"IF(Input!T$2=\"\",\"\",Input!T$2)","v":""},{"$f":"IF(Input!U$2=\"\",\"\",Input!U$2)","v":""},{"$f":"IF(Input!V$2=\"\",\"\",Input!V$2)","v":""},{"$f":"IF(Input!W$2=\"\",\"\",Input!W$2)","v":""},{"$f":"IF(Input!X$2=\"\",\"\",Input!X$2)","v":""},{"$f":"IF(Input!Y$2=\"\",\"\",Input!Y$2)","v":""},{"$f":"IF(Input!Z$2=\"\",\"\",Input!Z$2)","v":""},{"$f":"IF(Input!AA$2=\"\",\"\",Input!AA$2)","v":""},{"$f":"IF(Input!AB$2=\"\",\"\",Input!AB$2)","v":""},{"$f":"IF(Input!AC$2=\"\",\"\",Input!AC$2)","v":""},{"$f":"IF(Input!AD$2=\"\",\"\",Input!AD$2)","v":""},{"$f":"IF(Input!AE$2=\"\",\"\",Input!AE$2)","v":""},{"$f":"IF(Input!AF$2=\"\",\"\",Input!AF$2)","v":""},{"$f":"IF(Input!AG$2=\"\",\"\",Input!AG$2)","v":""},{"$f":"IF(Input!AH$2=\"\",\"\",Input!AH$2)","v":""},{"$f":"IF(Input!AI$2=\"\",\"\",Input!AI$2)","v":""},{"$f":"IF(Input!AJ$2=\"\",\"\",Input!AJ$2)","v":""},{"$f":"IF(Input!AK$2=\"\",\"\",Input!AK$2)","v":""},{"$f":"IF(Input!AL$2=\"\",\"\",Input!AL$2)","v":""},{"$f":"IF(Input!AM$2=\"\",\"\",Input!AM$2)","v":""},{"$f":"IF(Input!AN$2=\"\",\"\",Input!AN$2)","v":""},{"$f":"IF(Input!AO$2=\"\",\"\",Input!AO$2)","v":""},{"$f":"IF(Input!AP$2=\"\",\"\",Input!AP$2)","v":""},{"$f":"IF(Input!AQ$2=\"\",\"\",Input!AQ$2)","v":""},{"$f":"IF(Input!AR$2=\"\",\"\",Input!AR$2)","v":""},{"$f":"IF(Input!AS$2=\"\",\"\",Input!AS$2)","v":""},{"$f":"IF(Input!AT$2=\"\",\"\",Input!AT$2)","v":""},{"$f":"IF(Input!AU$2=\"\",\"\",Input!AU$2)","v":""},{"$f":"IF(Input!AV$2=\"\",\"\",Input!AV$2)","v":""},{"$f":"IF(Input!AW$2=\"\",\"\",Input!AW$2)","v":""},{"$f":"IF(Input!AX$2=\"\",\"\",Input!AX$2)","v":""},{"$f":"IF(Input!AY$2=\"\",\"\",Input!AY$2)","v":""},{"$f":"IF(Input!AZ$2=\"\",\"\",Input!AZ$2)","v":""},{"$f":"IF(Input!BA$2=\"\",\"\",Input!BA$2)","v":""},{"$f":"IF(Input!BB$2=\"\",\"\",Input!BB$2)","v":""},{"$f":"IF(Input!BC$2=\"\",\"\",Input!BC$2)","v":""},{"$f":"IF(Input!BD$2=\"\",\"\",Input!BD$2)","v":""},{"$f":"IF(Input!BE$2=\"\",\"\",Input!BE$2)","v":""},{"$f":"IF(Input!BF$2=\"\",\"\",Input!BF$2)","v":""},{"$f":"IF(Input!BG$2=\"\",\"\",Input!BG$2)","v":""},{"$f":"IF(Input!BH$2=\"\",\"\",Input!BH$2)","v":""},{"$f":"IF(Input!BI$2=\"\",\"\",Input!BI$2)","v":""},{"$f":"IF(Input!BJ$2=\"\",\"\",Input!BJ$2)","v":""}]
["Day 0",{"$f":"IFERROR(LOOKUP(10^99,Input!$B$3:$B$202),0)","v":40},{"$f":"IF(Input!$C2=\"\",NA(),SUM(Input!$C$3:'Input'!$C2))","v":5},0,null,null,null,null,null,null,null,null,null,{"$f":"IF(N$1=\"\",\"\",M$2-$B$2/(SUMPRODUCT(--($C$1:$BJ$1<>\"\"))))","v":""},"","","","","","","","","","","","","","","","","","","","",{"$f":"IF(AI$1=\"\",\"\",AH$2-$B$2/(SUMPRODUCT(--($C$1:$BJ$1<>\"\"))))","v":""},"","","","","","","","","","","","","","","","","","","","","","","","","","",""]
[{"$f":"IF(Input!$A3=\"\",\"\",Input!$A3)","v":"2015-01-01"},{"$f":"IF(Input!$B3=\"\",\"\",Input!$B3)","v":30},{"$f":"IF(Input!$C3=\"\",NA(),SUM(Input!$C$3:'Input'!$C3))","v":5},{"$f":"IF($A3=\"\",\"\",$D2+$B$2/SUMPRODUCT(--($A$3:$A$202<>\"\")))","v":2.5},null,null,null,null,null,null,null,null,null,{"$f":"IF(N$1=\"\",\"\",SUM(Input!N$3:N$202))","v":""},{"$f":"IF(O$1=\"\",\"\",SUM(Input!O$3:O$202))","v":""},{"$f":"IF(P$1=\"\",\"\",SUM(Input!P$3:P$202))","v":""},{"$f":"IF(Q$1=\"\",\"\",SUM(Input!Q$3:Q$202))","v":""},{"$f":"IF(R$1=\"\",\"\",SUM(Input!R$3:R$202))","v":""},{"$f":"IF(S$1=\"\",\"\",SUM(Input!S$3:S$202))","v":""},{"$f":"IF(T$1=\"\",\"\",SUM(Input!T$3:T$202))","v":""},{"$f":"IF(U$1=\"\",\"\",SUM(Input!U$3:U$202))","v":""},{"$f":"IF(V$1=\"\",\"\",SUM(Input!V$3:V$202))","v":""},{"$f":"IF(W$1=\"\",\"\",SUM(Input!W$3:W$202))","v":""},{"$f":"IF(X$1=\"\",\"\",SUM(Input!X$3:X$202))","v":""},{"$f":"IF(Y$1=\"\",\"\",SUM(Input!Y$3:Y$202))","v":""},{"$f":"IF(Z$1=\"\",\"\",SUM(Input!Z$3:Z$202))","v":""},{"$f":"IF(AA$1=\"\",\"\",SUM(Input!AA$3:AA$202))","v":""},{"$f":"IF(AB$1=\"\",\"\",SUM(Input!AB$3:AB$202))","v":""},{"$f":"IF(AC$1=\"\",\"\",SUM(Input!AC$3:AC$202))","v":""},{"$f":"IF(AD$1=\"\",\"\",SUM(Input!AD$3:AD$202))","v":""},{"$f":"IF(AE$1=\"\",\"\",SUM(Input!AE$3:AE$202))","v":""},{"$f":"IF(AF$1=\"\",\"\",SUM(Input!AF$3:AF$202))","v":""},{"$f":"IF(AG$1=\"\",\"\",SUM(Input!AG$3:AG$202))","v":""},{"$f":"IF(AH$1=\"\",\"\",SUM(Input!AH$3:AH$202))","v":""},{"$f":"IF(AI$1=\"\",\"\",SUM(Input!AI$3:AI$202))","v":""},{"$f":"IF(AJ$1=\"\",\"\",SUM(Input!AJ$3:AJ$202))","v":""},{"$f":"IF(AK$1=\"\",\"\",SUM(Input!AK$3:AK$202))","v":""},{"$f":"IF(AL$1=\"\",\"\",SUM(Input!AL$3:AL$202))","v":""},{"$f":"IF(AM$1=\"\",\"\",SUM(Input!AM$3:AM$202))","v":""},{"$f":"IF(AN$1=\"\",\"\",SUM(Input!AN$3:AN$202))","v":""},{"$f":"IF(AO$1=\"\",\"\",SUM(Input!AO$3:AO$202))","v":""},{"$f":"IF(AP$1=\"\",\"\",SUM(Input!AP$3:AP$202))","v":""},{"$f":"IF(AQ$1=\"\",\"\",SUM(Input!AQ$3:AQ$202))","v":""},{"$f":"IF(AR$1=\"\",\"\",SUM(Input!AR$3:AR$202))","v":""},{"$f":"IF(AS$1=\"\",\"\",SUM(Input!AS$3:AS$202))","v":""},{"$f":"IF(AT$1=\"\",\"\",SUM(Input!AT$3:AT$202))","v":""},{"$f":"IF(AU$1=\"\",\"\",SUM(Input!AU$3:AU$202))","v":""},{"$f":"IF(AV$1=\"\",\"\",SUM(Input!AV$3:AV$202))","v":""},{"$f":"IF(AW$1=\"\",\"\",SUM(Input!AW$3:AW$202))","v":""},{"$f":"IF(AX$1=\"\",\"\",SUM(Input!AX$3:AX$202))","v":""},{"$f":"IF(AY$1=\"\",\"\",SUM(Input!AY$3:AY$202))","v":""},{"$f":"IF(AZ$1=\"\",\"\",SUM(Input!AZ$3:AZ$202))","v":""},{"$f":"IF(BA$1=\"\",\"\",SUM(Input!BA$3:BA$202))","v":""},{"$f":"IF(BB$1=\"\",\"\",SUM(Input!BB$3:BB$202))","v":""},{"$f":"IF(BC$1=\"\",\"\",SUM(Input!BC$3:BC$202))","v":""},{"$f":"IF(BD$1=\"\",\"\",SUM(Input!BD$3:BD$202))","v":""},{"$f":"IF(BE$1=\"\",\"\",SUM(Input!BE$3:BE$202))","v":""},{"$f":"IF(BF$1=\"\",\"\",SUM(Input!BF$3:BF$202))","v":""},{"$f":"IF(BG$1=\"\",\"\",SUM(Input!BG$3:BG$202))","v":""},{"$f":"IF(BH$1=\"\",\"\",SUM(Input!BH$3:BH$202))","v":""},{"$f":"IF(BI$1=\"\",\"\",SUM(Input!BI$3:BI$202))","v":""},{"$f":"IF(BJ$1=\"\",\"\",SUM(Input!BJ$3:BJ$202))","v":""}]
[{"$f":"IF(Input!$A4=\"\",\"\",Input!$A4)","v":"2015-01-02"},{"$f":"IF(Input!$B4=\"\",\"\",Input!$B4)","v":30},{"$f":"IF(Input!$C4=\"\",NA(),SUM(Input!$C$3:'Input'!$C4))","v":8},{"$f":"IF($A4=\"\",\"\",$D3+$B$2/SUMPRODUCT(--($A$3:$A$202<>\"\")))","v":5},null,null,null,null,null,null,null,null,null,{"$f":"IF(N$1=\"\",\"\",CountCTs(Input!N$3:N$202))","v":""},{"$f":"IF(O$1=\"\",\"\",CountCTs(Input!O$3:O$202))","v":""},{"$f":"IF(P$1=\"\",\"\",CountCTs(Input!P$3:P$202))","v":""},{"$f":"IF(Q$1=\"\",\"\",CountCTs(Input!Q$3:Q$202))","v":""},{"$f":"IF(R$1=\"\",\"\",CountCTs(Input!R$3:R$202))","v":""},{"$f":"IF(S$1=\"\",\"\",CountCTs(Input!S$3:S$202))","v":""},{"$f":"IF(T$1=\"\",\"\",CountCTs(Input!T$3:T$202))","v":""},{"$f":"IF(U$1=\"\",\"\",CountCTs(Input!U$3:U$202))","v":""},{"$f":"IF(V$1=\"\",\"\",CountCTs(Input!V$3:V$202))","v":""},{"$f":"IF(W$1=\"\",\"\",CountCTs(Input!W$3:W$202))","v":""},{"$f":"IF(X$1=\"\",\"\",CountCTs(Input!X$3:X$202))","v":""},{"$f":"IF(Y$1=\"\",\"\",CountCTs(Input!Y$3:Y$202))","v":""},{"$f":"IF(Z$1=\"\",\"\",CountCTs(Input!Z$3:Z$202))","v":""},{"$f":"IF(AA$1=\"\",\"\",CountCTs(Input!AA$3:AA$202))","v":""},{"$f":"IF(AB$1=\"\",\"\",CountCTs(Input!AB$3:AB$202))","v":""},{"$f":"IF(AC$1=\"\",\"\",CountCTs(Input!AC$3:AC$202))","v":""},{"$f":"IF(AD$1=\"\",\"\",CountCTs(Input!AD$3:AD$202))","v":""},{"$f":"IF(AE$1=\"\",\"\",CountCTs(Input!AE$3:AE$202))","v":""},{"$f":"IF(AF$1=\"\",\"\",CountCTs(Input!AF$3:AF$202))","v":""},{"$f":"IF(AG$1=\"\",\"\",CountCTs(Input!AG$3:AG$202))","v":""},{"$f":"IF(AH$1=\"\",\"\",CountCTs(Input!AH$3:AH$202))","v":""},{"$f":"IF(AI$1=\"\",\"\",CountCTs(Input!AI$3:AI$202))","v":""},{"$f":"IF(AJ$1=\"\",\"\",CountCTs(Input!AJ$3:AJ$202))","v":""},{"$f":"IF(AK$1=\"\",\"\",CountCTs(Input!AK$3:AK$202))","v":""},{"$f":"IF(AL$1=\"\",\"\",CountCTs(Input!AL$3:AL$202))","v":""},{"$f":"IF(AM$1=\"\",\"\",CountCTs(Input!AM$3:AM$202))","v":""},{"$f":"IF(AN$1=\"\",\"\",CountCTs(Input!AN$3:AN$202))","v":""},{"$f":"IF(AO$1=\"\",\"\",CountCTs(Input!AO$3:AO$202))","v":""},{"$f":"IF(AP$1=\"\",\"\",CountCTs(Input!AP$3:AP$202))","v":""},{"$f":"IF(AQ$1=\"\",\"\",CountCTs(Input!AQ$3:AQ$202))","v":""},{"$f":"IF(AR$1=\"\",\"\",CountCTs(Input!AR$3:AR$202))","v":""},{"$f":"IF(AS$1=\"\",\"\",CountCTs(Input!AS$3:AS$202))","v":""},{"$f":"IF(AT$1=\"\",\"\",CountCTs(Input!AT$3:AT$202))","v":""},{"$f":"IF(AU$1=\"\",\"\",CountCTs(Input!AU$3:AU$202))","v":""},{"$f":"IF(AV$1=\"\",\"\",CountCTs(Input!AV$3:AV$202))","v":""},{"$f":"IF(AW$1=\"\",\"\",CountCTs(Input!AW$3:AW$202))","v":""},{"$f":"IF(AX$1=\"\",\"\",CountCTs(Input!AX$3:AX$202))","v":""},{"$f":"IF(AY$1=\"\",\"\",CountCTs(Input!AY$3:AY$202))","v":""},{"$f":"IF(AZ$1=\"\",\"\",CountCTs(Input!AZ$3:AZ$202))","v":""},{"$f":"IF(BA$1=\"\",\"\",CountCTs(Input!BA$3:BA$202))","v":""},{"$f":"IF(BB$1=\"\",\"\",CountCTs(Input!BB$3:BB$202))","v":""},{"$f":"IF(BC$1=\"\",\"\",CountCTs(Input!BC$3:BC$202))","v":""},{"$f":"IF(BD$1=\"\",\"\",CountCTs(Input!BD$3:BD$202))","v":""},{"$f":"IF(BE$1=\"\",\"\",CountCTs(Input!BE$3:BE$202))","v":""},{"$f":"IF(BF$1=\"\",\"\",CountCTs(Input!BF$3:BF$202))","v":""},{"$f":"IF(BG$1=\"\",\"\",CountCTs(Input!BG$3:BG$202))","v":""},{"$f":"IF(BH$1=\"\",\"\",CountCTs(Input!BH$3:BH$202))","v":""},{"$f":"IF(BI$1=\"\",\"\",CountCTs(Input!BI$3:BI$202))","v":""},{"$f":"IF(BJ$1=\"\",\"\",CountCTs(Input!BJ$3:BJ$202))","v":""}]
[{"$f":"IF(Input!$A5=\"\",\"\",Input!$A5)","v":"2015-01-03"},{"$f":"IF(Input!$B5=\"\",\"\",Input!$B5)","v":30},{"$f":"IF(Input!$C5=\"\",NA(),SUM(Input!$C$3:'Input'!$C5))","v":12},7.5,null,null,null,null,null,null,null,null,null,{"$f":"IF(N$1=\"\",\"\",M$5-N4)","v":""},{"$f":"SUM(OFFSET('Final Data'!$A$1,1,2,SUMPRODUCT(--(NOT(ISNA('Final Data'!$C$2:$C$202))))))","v":526},"","","","","","","","","","","","","","","","","","","","","","","","","","","","","","","","","","","","","","","","","","","","","","",""]
[{"$f":"IF(Input!$A6=\"\",\"\",Input!$A6)","v":"2015-01-04"},{"$f":"IF(Input!$B6=\"\",\"\",Input!$B6)","v":30},{"$f":"IF(Input!$C6=\"\",NA(),SUM(Input!$C$3:'Input'!$C6))","v":18},10]
[{"$f":"IF(Input!$A7=\"\",\"\",Input!$A7)","v":"2015-01-05"},{"$f":"IF(Input!$B7=\"\",\"\",Input!$B7)","v":25},{"$f":"IF(Input!$C7=\"\",NA(),SUM(Input!$C$3:'Input'!$C7))","v":19},12.5]
[{"$f":"IF(Input!$A8=\"\",\"\",Input!$A8)","v":"2015-01-06"},{"$f":"IF(Input!$B8=\"\",\"\",Input!$B8)","v":25},{"$f":"IF(Input!$C8=\"\",NA(),SUM(Input!$C$3:'Input'!$C8))","v":24},15]
[{"$f":"IF(Input!$A9=\"\",\"\",Input!$A9)","v":"2015-01-07"},{"$f":"IF(Input!$B9=\"\",\"\",Input!$B9)","v":40},{"$f":"IF(Input!$C9=\"\",NA(),SUM(Input!$C$3:'Input'!$C9))","v":30},17.5]
[{"$f":"IF(Input!$A10=\"\",\"\",Input!$A10)","v":"2015-01-08"},{"$f":"IF(Input!$B10=\"\",\"\",Input!$B10)","v":40},{"$f":"IF(Input!$C10=\"\",NA(),SUM(Input!$C$3:'Input'!$C10))","v":37},20]
[{"$f":"IF(Input!$A11=\"\",\"\",Input!$A11)","v":"2015-01-09"},{"$f":"IF(Input!$B11=\"\",\"\",Input!$B11)","v":40},{"$f":"IF(Input!$C11=\"\",NA(),SUM(Input!$C$3:'Input'!$C11))","v":39},22.5]
[{"$f":"IF(Input!$A12=\"\",\"\",Input!$A12)","v":"2015-01-10"},{"$f":"IF(Input!$B12=\"\",\"\",Input!$B12)","v":40},{"$f":"IF(Input!$C12=\"\",NA(),SUM(Input!$C$3:'Input'!$C12))","v":41},25]
[{"$f":"IF(Input!$A13=\"\",\"\",Input!$A13)","v":"2015-01-11"},{"$f":"IF(Input!$B13=\"\",\"\",Input!$B13)","v":40},{"$f":"IF(Input!$C13=\"\",NA(),SUM(Input!$C$3:'Input'!$C13))","v":43},27.5]
[{"$f":"IF(Input!$A14=\"\",\"\",Input!$A14)","v":"2015-01-12"},{"$f":"IF(Input!$B14=\"\",\"\",Input!$B14)","v":40},{"$f":"IF(Input!$C14=\"\",NA(),SUM(Input!$C$3:'Input'!$C14))","v":45},30]
[{"$f":"IF(Input!$A15=\"\",\"\",Input!$A15)","v":"2015-01-13"},{"$f":"IF(Input!$B15=\"\",\"\",Input!$B15)","v":40},{"$f":"IF(Input!$C15=\"\",NA(),SUM(Input!$C$3:'Input'!$C15))","v":47},32.5]
[{"$f":"IF(Input!$A16=\"\",\"\",Input!$A16)","v":"2015-01-14"},{"$f":"IF(Input!$B16=\"\",\"\",Input!$B16)","v":40},{"$f":"IF(Input!$C16=\"\",NA(),SUM(Input!$C$3:'Input'!$C16))","v":49},35]
[{"$f":"IF(Input!$A17=\"\",\"\",Input!$A17)","v":"2015-01-15"},{"$f":"IF(Input!$B17=\"\",\"\",Input!$B17)","v":40},{"$f":"IF(Input!$C17=\"\",NA(),SUM(Input!$C$3:'Input'!$C17))","v":51},37.5]
[{"$f":"IF(Input!$A18=\"\",\"\",Input!$A18)","v":"2015-01-16"},{"$f":"IF(Input!$B18=\"\",\"\",Input!$B18)","v":40},{"$f":"IF(Input!$C18=\"\",NA(),SUM(Input!$C$3:'Input'!$C18))","v":53},40]
[{"$f":"IF(Input!$A19=\"\",\"\",Input!$A19)","v":""},{"$f":"IF(Input!$B19=\"\",\"\",Input!$B19)","v":""},{"$f":"IF(Input!$C19=\"\",NA(),SUM(Input!$C$3:'Input'!$C19))","v":{"$error":"#N/A"}},""]
[{"$f":"IF(Input!$A20=\"\",\"\",Input!$A20)","v":""},{"$f":"IF(Input!$B20=\"\",\"\",Input!$B20)","v":""},{"$f":"IF(Input!$C20=\"\",NA(),SUM(Input!$C$3:'Input'!$C20))","v":{"$error":"#N/A"}},""]
[{"$f":"IF(Input!$A21=\"\",\"\",Input!$A21)","v":""},{"$f":"IF(Input!$B21=\"\",\"\",Input!$B21)","v":""},{"$f":"IF(Input!$C21=\"\",NA(),SUM(Input!$C$3:'Input'!$C21))","v":{"$error":"#N/A"}},""]
[{"$f":"IF(Input!$A22=\"\",\"\",Input!$A22)","v":""},{"$f":"IF(Input!$B22=\"\",\"\",Input!$B22)","v":""},{"$f":"IF(Input!$C22=\"\",NA(),SUM(Input!$C$3:'Input'!$C22))","v":{"$error":"#N/A"}},""]
[{"$f":"IF(Input!$A23=\"\",\"\",Input!$A23)","v":""},{"$f":"IF(Input!$B23=\"\",\"\",Input!$B23)","v":""},{"$f":"IF(Input!$C23=\"\",NA(),SUM(Input!$C$3:'Input'!$C23))","v":{"$error":"#N/A"}},""]
[{"$f":"IF(Input!$A24=\"\",\"\",Input!$A24)","v":""},{"$f":"IF(Input!$B24=\"\",\"\",Input!$B24)","v":""},{"$f":"IF(Input!$C24=\"\",NA(),SUM(Input!$C$3:'Input'!$C24))","v":{"$error":"#N/A"}},""]
[{"$f":"IF(Input!$A25=\"\",\"\",Input!$A25)","v":""},{"$f":"IF(Input!$B25=\"\",\"\",Input!$B25)","v":""},{"$f":"IF(Input!$C25=\"\",NA(),SUM(Input!$C$3:'Input'!$C25))","v":{"$error":"#N/A"}},""]
[{"$f":"IF(Input!$A26=\"\",\"\",Input!$A26)","v":""},{"$f":"IF(Input!$B26=\"\",\"\",Input!$B26)","v":""},{"$f":"IF(Input!$C26=\"\",NA(),SUM(Input!$C$3:'Input'!$C26))","v":{"$error":"#N/A"}},""]
[{"$f":"IF(Input!$A27=\"\",\"\",Input!$A27)","v":""},{"$f":"IF(Input!$B27=\"\",\"\",Input!$B27)","v":""},{"$f":"IF(Input!$C27=\"\",NA(),SUM(Input!$C$3:'Input'!$C27))","v":{"$error":"#N/A"}},""]
[{"$f":"IF(Input!$A28=\"\",\"\",Input!$A28)","v":""},{"$f":"IF(Input!$B28=\"\",\"\",Input!$B28)","v":""},{"$f":"IF(Input!$C28=\"\",NA(),SUM(Input!$C$3:'Input'!$C28))","v":{"$error":"#N/A"}},""]
[{"$f":"IF(Input!$A29=\"\",\"\",Input!$A29)","v":""},{"$f":"IF(Input!$B29=\"\",\"\",Input!$B29)","v":""},{"$f":"IF(Input!$C29=\"\",NA(),SUM(Input!$C$3:'Input'!$C29))","v":{"$error":"#N/A"}},""]
[{"$f":"IF(Input!$A30=\"\",\"\",Input!$A30)","v":""},{"$f":"IF(Input!$B30=\"\",\"\",Input!$B30)","v":""},{"$f":"IF(Input!$C30=\"\",NA(),SUM(Input!$C$3:'Input'!$C30))","v":{"$error":"#N/A"}},""]
[{"$f":"IF(Input!$A31=\"\",\"\",Input!$A31)","v":""},{"$f":"IF(Input!$B31=\"\",\"\",Input!$B31)","v":""},{"$f":"IF(Input!$C31=\"\",NA(),SUM(Input!$C$3:'Input'!$C31))","v":{"$error":"#N/A"}},""]
[{"$f":"IF(Input!$A32=\"\",\"\",Input!$A32)","v":""},{"$f":"IF(Input!$B32=\"\",\"\",Input!$B32)","v":""},{"$f":"IF(Input!$C32=\"\",NA(),SUM(Input!$C$3:'Input'!$C32))","v":{"$error":"#N/A"}},""]
[{"$f":"IF(Input!$A33=\"\",\"\",Input!$A33)","v":""},{"$f":"IF(Input!$B33=\"\",\"\",Input!$B33)","v":""},{"$f":"IF(Input!$C33=\"\",NA(),SUM(Input!$C$3:'Input'!$C33))","v":{"$error":"#N/A"}},""]
[{"$f":"IF(Input!$A34=\"\",\"\",Input!$A34)","v":""},{"$f":"IF(Input!$B34=\"\",\"\",Input!$B34)","v":""},{"$f":"IF(Input!$C34=\"\",NA(),SUM(Input!$C$3:'Input'!$C34))","v":{"$error":"#N/A"}},""]
[{"$f":"IF(Input!$A35=\"\",\"\",Input!$A35)","v":""},{"$f":"IF(Input!$B35=\"\",\"\",Input!$B35)","v":""},{"$f":"IF(Input!$C35=\"\",NA(),SUM(Input!$C$3:'Input'!$C35))","v":{"$error":"#N/A"}},""]
[{"$f":"IF(Input!$A36=\"\",\"\",Input!$A36)","v":""},{"$f":"IF(Input!$B36=\"\",\"\",Input!$B36)","v":""},{"$f":"IF(Input!$C36=\"\",NA(),SUM(Input!$C$3:'Input'!$C36))","v":{"$error":"#N/A"}},""]
[{"$f":"IF(Input!$A37=\"\",\"\",Input!$A37)","v":""},{"$f":"IF(Input!$B37=\"\",\"\",Input!$B37)","v":""},{"$f":"IF(Input!$C37=\"\",NA(),SUM(Input!$C$3:'Input'!$C37))","v":{"$error":"#N/A"}},""]
[{"$f":"IF(Input!$A38=\"\",\"\",Input!$A38)","v":""},{"$f":"IF(Input!$B38=\"\",\"\",Input!$B38)","v":""},{"$f":"IF(Input!$C38=\"\",NA(),SUM(Input!$C$3:'Input'!$C38))","v":{"$error":"#N/A"}},""]
[{"$f":"IF(Input!$A39=\"\",\"\",Input!$A39)","v":""},{"$f":"IF(Input!$B39=\"\",\"\",Input!$B39)","v":""},{"$f":"IF(Input!$C39=\"\",NA(),SUM(Input!$C$3:'Input'!$C39))","v":{"$error":"#N/A"}},""]
[{"$f":"IF(Input!$A40=\"\",\"\",Input!$A40)","v":""},{"$f":"IF(Input!$B40=\"\",\"\",Input!$B40)","v":""},{"$f":"IF(Input!$C40=\"\",NA(),SUM(Input!$C$3:'Input'!$C40))","v":{"$error":"#N/A"}},""]
[{"$f":"IF(Input!$A41=\"\",\"\",Input!$A41)","v":""},{"$f":"IF(Input!$B41=\"\",\"\",Input!$B41)","v":""},{"$f":"IF(Input!$C41=\"\",NA(),SUM(Input!$C$3:'Input'!$C41))","v":{"$error":"#N/A"}},""]
[{"$f":"IF(Input!$A42=\"\",\"\",Input!$A42)","v":""},{"$f":"IF(Input!$B42=\"\",\"\",Input!$B42)","v":""},{"$f":"IF(Input!$C42=\"\",NA(),SUM(Input!$C$3:'Input'!$C42))","v":{"$error":"#N/A"}},""]
[{"$f":"IF(Input!$A43=\"\",\"\",Input!$A43)","v":""},{"$f":"IF(Input!$B43=\"\",\"\",Input!$B43)","v":""},{"$f":"IF(Input!$C43=\"\",NA(),SUM(Input!$C$3:'Input'!$C43))","v":{"$error":"#N/A"}},""]
[{"$f":"IF(Input!$A44=\"\",\"\",Input!$A44)","v":""},{"$f":"IF(Input!$B44=\"\",\"\",Input!$B44)","v":""},{"$f":"IF(Input!$C44=\"\",NA(),SUM(Input!$C$3:'Input'!$C44))","v":{"$error":"#N/A"}},""]
[{"$f":"IF(Input!$A45=\"\",\"\",Input!$A45)","v":""},{"$f":"IF(Input!$B45=\"\",\"\",Input!$B45)","v":""},{"$f":"IF(Input!$C45=\"\",NA(),SUM(Input!$C$3:'Input'!$C45))","v":{"$error":"#N/A"}},""]
[{"$f":"IF(Input!$A46=\"\",\"\",Input!$A46)","v":""},{"$f":"IF(Input!$B46=\"\",\"\",Input!$B46)","v":""},{"$f":"IF(Input!$C46=\"\",NA(),SUM(Input!$C$3:'Input'!$C46))","v":{"$error":"#N/A"}},""]
[{"$f":"IF(Input!$A47=\"\",\"\",Input!$A47)","v":""},{"$f":"IF(Input!$B47=\"\",\"\",Input!$B47)","v":""},{"$f":"IF(Input!$C47=\"\",NA(),SUM(Input!$C$3:'Input'!$C47))","v":{"$error":"#N/A"}},""]
[{"$f":"IF(Input!$A48=\"\",\"\",Input!$A48)","v":""},{"$f":"IF(Input!$B48=\"\",\"\",Input!$B48)","v":""},{"$f":"IF(Input!$C48=\"\",NA(),SUM(Input!$C$3:'Input'!$C48))","v":{"$error":"#N/A"}},""]
[{"$f":"IF(Input!$A49=\"\",\"\",Input!$A49)","v":""},{"$f":"IF(Input!$B49=\"\",\"\",Input!$B49)","v":""},{"$f":"IF(Input!$C49=\"\",NA(),SUM(Input!$C$3:'Input'!$C49))","v":{"$error":"#N/A"}},""]
[{"$f":"IF(Input!$A50=\"\",\"\",Input!$A50)","v":""},{"$f":"IF(Input!$B50=\"\",\"\",Input!$B50)","v":""},{"$f":"IF(Input!$C50=\"\",NA(),SUM(Input!$C$3:'Input'!$C50))","v":{"$error":"#N/A"}},""]
[{"$f":"IF(Input!$A51=\"\",\"\",Input!$A51)","v":""},{"$f":"IF(Input!$B51=\"\",\"\",Input!$B51)","v":""},{"$f":"IF(Input!$C51=\"\",NA(),SUM(Input!$C$3:'Input'!$C51))","v":{"$error":"#N/A"}},""]
[{"$f":"IF(Input!$A52=\"\",\"\",Input!$A52)","v":""},{"$f":"IF(Input!$B52=\"\",\"\",Input!$B52)","v":""},{"$f":"IF(Input!$C52=\"\",NA(),SUM(Input!$C$3:'Input'!$C52))","v":{"$error":"#N/A"}},""]
[{"$f":"IF(Input!$A53=\"\",\"\",Input!$A53)","v":""},{"$f":"IF(Input!$B53=\"\",\"\",Input!$B53)","v":""},{"$f":"IF(Input!$C53=\"\",NA(),SUM(Input!$C$3:'Input'!$C53))","v":{"$error":"#N/A"}},""]
[{"$f":"IF(Input!$A54=\"\",\"\",Input!$A54)","v":""},{"$f":"IF(Input!$B54=\"\",\"\",Input!$B54)","v":""},{"$f":"IF(Input!$C54=\"\",NA(),SUM(Input!$C$3:'Input'!$C54))","v":{"$error":"#N/A"}},""]
[{"$f":"IF(Input!$A55=\"\",\"\",Input!$A55)","v":""},{"$f":"IF(Input!$B55=\"\",\"\",Input!$B55)","v":""},{"$f":"IF(Input!$C55=\"\",NA(),SUM(Input!$C$3:'Input'!$C55))","v":{"$error":"#N/A"}},""]
[{"$f":"IF(Input!$A56=\"\",\"\",Input!$A56)","v":""},{"$f":"IF(Input!$B56=\"\",\"\",Input!$B56)","v":""},{"$f":"IF(Input!$C56=\"\",NA(),SUM(Input!$C$3:'Input'!$C56))","v":{"$error":"#N/A"}},""]
[{"$f":"IF(Input!$A57=\"\",\"\",Input!$A57)","v":""},{"$f":"IF(Input!$B57=\"\",\"\",Input!$B57)","v":""},{"$f":"IF(Input!$C57=\"\",NA(),SUM(Input!$C$3:'Input'!$C57))","v":{"$error":"#N/A"}},""]
[{"$f":"IF(Input!$A58=\"\",\"\",Input!$A58)","v":""},{"$f":"IF(Input!$B58=\"\",\"\",Input!$B58)","v":""},{"$f":"IF(Input!$C58=\"\",NA(),SUM(Input!$C$3:'Input'!$C58))","v":{"$error":"#N/A"}},""]
[{"$f":"IF(Input!$A59=\"\",\"\",Input!$A59)","v":""},{"$f":"IF(Input!$B59=\"\",\"\",Input!$B59)","v":""},{"$f":"IF(Input!$C59=\"\",NA(),SUM(Input!$C$3:'Input'!$C59))","v":{"$error":"#N/A"}},""]
[{"$f":"IF(Input!$A60=\"\",\"\",Input!$A60)","v":""},{"$f":"IF(Input!$B60=\"\",\"\",Input!$B60)","v":""},{"$f":"IF(Input!$C60=\"\",NA(),SUM(Input!$C$3:'Input'!$C60))","v":{"$error":"#N/A"}},""]
{"$rows_left_out":142}